BDBM50419918 CHEMBL1956719
SMILES [#6]-c1cc(-[#6])c2cccc(-[#8]-[#6]-c3c(Cl)ccc(c3Cl)S(=O)(=O)[#7]C3([#6]-[#6]-[#8]-[#6]-[#6]3)[#6](=O)-[#7]-3-[#6]-[#6]-[#7](-[#6]-[#6]-3)-[#6](=O)-[#6@@H](-[#7])-[#6]-[#6]-[#6]-[#6]\[#7]=[#6](/[#7])-[#7])c2n1
InChI Key InChIKey=KUTHJKKCCLLPIU-MHZLTWQESA-N
Data  2 KI
  Tab Delimited (TSV)   2D SDfile   Computed 3D by Vconf -m prep SDfile
Find this compound or compounds like it in BindingDB:
Activity Spreadsheet -- Enzyme Inhibition Constant Data from BindingDB
Found 2 hits for monomerid = 50419918
TargetB2 bradykinin receptor(Homo sapiens (Human))
Menarini Ricerche
Curated by ChEMBL
LigandPNGBDBM50419918(CHEMBL1956719)
Affinity DataKi:  0.0631nM. Assay description: Displacement of [3H]-Bradykinin from human bradykinin B2 receptor expressed in CHO cells membrane after 60 mins by scintillation counting
In DepthDetails ArticlePubMed
TargetB1 bradykinin receptor(Homo sapiens (Human))
Menarini Ricerche
Curated by ChEMBL
LigandPNGBDBM50419918(CHEMBL1956719)
Affinity DataKi: >1.00E+4nM. Assay description: Displacement of [3H][desArg9]Lys-Bradykinin from human bradykinin B1 receptor expressed in CHO cells
In DepthDetails ArticlePubMed