BDBM50422977 CHEMBL228963
SMILES Cc1ccc(-c2cc(Cl)ccc2OCc2ccccc2)n1-c1cc(C(O)=O)c2cc[nH]c2c1
InChI Key InChIKey=BEHWVVDVWLWXCI-UHFFFAOYSA-N
Data  1 IC50
  Tab Delimited (TSV)   2D SDfile   Computed 3D by Vconf -m prep SDfile
Find this compound or compounds like it in BindingDB:
Activity Spreadsheet -- Enzyme Inhibition Constant Data from BindingDB
Found 1 hit for monomerid = 50422977
TargetProstaglandin E2 receptor EP1 subtype(Homo sapiens (Human))
Glaxosmithkline
Curated by ChEMBL
LigandPNGBDBM50422977(CHEMBL228963)
Affinity DataIC50:  1.30nM. Assay description: Displacement of [3H]PGE2 from human recombinant EP1 receptor expressed in CHOK1 cell membrane
In DepthDetails ArticlePubMed