BDBM50425433 METHIOTHEPINE
SMILES CSc1ccc2CC=C(CCN)c2c1
InChI Key InChIKey=RTASPUXNIKGFBD-UHFFFAOYSA-N
Data  1 IC50
  Tab Delimited (TSV)   2D SDfile   Computed 3D by Vconf -m prep SDfile
Find this compound or compounds like it in BindingDB:
Activity Spreadsheet -- Enzyme Inhibition Constant Data from BindingDB
Found 1 hit for monomerid = 50425433
Target5-hydroxytryptamine receptor 7(Homo sapiens (Human))
Jagiellonian University Medical College
Curated by ChEMBL
LigandPNGBDBM50425433(METHIOTHEPINE)
Affinity DataIC50:  2.20nM. Assay description: Antagonist activity at human 5HT7 receptor expressed in HEK293 assessed as inhibition of 5HT-induced cAMP accumulation
Ligand InfoPC cidPC sid
In DepthDetails ArticlePubMed