BDBM50425588 CHEMBL1965488
SMILES COc1ccc(Oc2c(Cl)cnn(Cc3cccc4ccccc34)c2=O)cc1OC
InChI Key InChIKey=YUJHALGBDPWFPQ-UHFFFAOYSA-N
Data  1 IC50
  Tab Delimited (TSV)   2D SDfile   Computed 3D by Vconf -m prep SDfile
Find this compound or compounds like it in BindingDB:
Activity Spreadsheet -- Enzyme Inhibition Constant Data from BindingDB
Found 1 hit for monomerid = 50425588
TargetNeuropeptides B/W receptor type 1(Homo sapiens (Human))
The Scripps Research Institute
Curated by ChEMBL
LigandPNGBDBM50425588(CHEMBL1965488)
Affinity DataIC50:  290nM. Assay description: Antagonist activity against human NPBWR1 expressed in HEK293 cells co-expressing Gqi3 assessed as inhibition of agonist-induced response by FLIPR ass...
In DepthDetails ArticlePubMed