BDBM50425634 CHEMBL2314289
SMILES Cc1ccccc1-n1ncc(Cl)c(Oc2ccc(CO)cc2)c1=O
InChI Key InChIKey=AFHSNKMIHQOULL-UHFFFAOYSA-N
Data  1 IC50
  Tab Delimited (TSV)   2D SDfile   Computed 3D by Vconf -m prep SDfile
Find this compound or compounds like it in BindingDB:
Activity Spreadsheet -- Enzyme Inhibition Constant Data from BindingDB
Found 1 hit for monomerid = 50425634
TargetNeuropeptides B/W receptor type 1(Homo sapiens (Human))
The Scripps Research Institute
Curated by ChEMBL
LigandPNGBDBM50425634(CHEMBL2314289)
Affinity DataIC50:  730nM. Assay description: Antagonist activity against human NPBWR1 expressed in HEK293 cells co-expressing Gqi3 assessed as inhibition of agonist-induced response by FLIPR ass...
In DepthDetails ArticlePubMed