BDBM50427205 CHEMBL2324854
SMILES Cc1ccccc1-c1n[nH]c(=O)o1
InChI Key InChIKey=HNMIXYJTZWBBCA-UHFFFAOYSA-N
Data  5 IC50
  Tab Delimited (TSV)   2D SDfile   Computed 3D by Vconf -m prep SDfile
Find this compound or compounds like it in BindingDB:
Activity Spreadsheet -- Enzyme Inhibition Constant Data from BindingDB
Found 5 hits for monomerid = 50427205
TargetD-aspartate oxidase(Homo sapiens (Human))
Kitasato University
Curated by ChEMBL
LigandPNGBDBM50427205(CHEMBL2324854)
Affinity DataIC50: >5.00E+6nM. Assay description: Inhibition of human recombinant N-terminal His-tagged DDO expressed in Escherichia coli BL21(DE3) using D-aspartate as substrate by colorimetric assa...
In DepthDetails ArticlePubMed
TargetD-amino-acid oxidase(Homo sapiens (Human))
Kitasato University
Curated by ChEMBL
LigandPNGBDBM50427205(CHEMBL2324854)
Affinity DataIC50:  2.98E+5nM. Assay description: Inhibition of human recombinant N-terminal His-tagged DAO expressed in Escherichia coli BL21(DE3) using D-alanine as substrate by colorimetric assay
In DepthDetails ArticlePubMed
TargetPalmitoleoyl-protein carboxylesterase NOTUM(Homo sapiens (Human))
University College London
Curated by ChEMBL
LigandPNGBDBM50427205(CHEMBL2324854)
Affinity DataIC50:  3.60nM. Assay description: Inhibition of human Notum (S81-T451 residues) C330S mutant expressed in HEK293S cells using OPTS substrate incubated for 40 mins by fluorescence base...
In DepthDetails ArticlePubMed
TargetSerine racemase(Homo sapiens (Human))
Kitasato University
Curated by ChEMBL
LigandPNGBDBM50427205(CHEMBL2324854)
Affinity DataIC50: >5.00E+6nM. Assay description: Inhibition of human recombinant N-terminal His-tagged serine racemase expressed in Escherichia coli BL21(DE3) using L-serine as substrate after 10 mi...
In DepthDetails ArticlePubMed
TargetD-amino-acid oxidase(Homo sapiens (Human))
Kitasato University
Curated by ChEMBL
LigandPNGBDBM50427205(CHEMBL2324854)
Affinity DataIC50:  1.99E+5nM. Assay description: Inhibition of human recombinant N-terminal His-tagged DAO expressed in Escherichia coli BL21(DE3) using D-serine as substrate by colorimetric assay
In DepthDetails ArticlePubMed