BDBM50427520 CHEMBL2322262
SMILES Cc1c(CCC(=O)Nc2cccc(O)c2)c(=O)oc2c(C)c3oc4CCCCc4c3cc12
InChI Key InChIKey=YIIREXBIWWXISD-UHFFFAOYSA-N
Data  1 EC50
  Tab Delimited (TSV)   2D SDfile   Computed 3D by Vconf -m prep SDfile
Find this compound or compounds like it in BindingDB:
Activity Spreadsheet -- Enzyme Inhibition Constant Data from BindingDB
Found 1 hit for monomerid = 50427520
TargetNuclear factor NF-kappa-B p105 subunit(Homo sapiens (Human))
Universit£
Curated by ChEMBL
LigandPNGBDBM50427520(CHEMBL2322262)
Affinity DataEC50:  7.00E+5nM. Assay description: Inhibition of human NF-kappaB p50/DNA interaction using 32P-labeled oligonucleotides as substrate preincubated for 20 mins before substrate addition ...
In DepthDetails ArticlePubMed