BDBM50427529 CHEMBL2321881
SMILES Cc1oc2cc3oc(=O)c(CCC(=O)Nc4cccc(c4)C(O)=O)c(C)c3cc2c1C
InChI Key InChIKey=FYTBWSGXGAHVOT-UHFFFAOYSA-N
Data  1 EC50
  Tab Delimited (TSV)   2D SDfile   Computed 3D by Vconf -m prep SDfile
Find this compound or compounds like it in BindingDB:
Activity Spreadsheet -- Enzyme Inhibition Constant Data from BindingDB
Found 1 hit for monomerid = 50427529
TargetNuclear factor NF-kappa-B p105 subunit(Homo sapiens (Human))
Universit£
Curated by ChEMBL
LigandPNGBDBM50427529(CHEMBL2321881)
Affinity DataEC50:  6.00E+5nM. Assay description: Inhibition of human NF-kappaB p50/DNA interaction using 32P-labeled oligonucleotides as substrate preincubated for 20 mins before substrate addition ...
In DepthDetails ArticlePubMed