BDBM50427544 CHEMBL2322273
SMILES Cc1oc2c(C)c3oc(=O)c(CC(=O)Nc4ccc(cc4)C(O)=O)c(C)c3cc2c1C
InChI Key InChIKey=BGVXWNIDNVVLJX-UHFFFAOYSA-N
Data  1 EC50
  Tab Delimited (TSV)   2D SDfile   Computed 3D by Vconf -m prep SDfile
Find this compound or compounds like it in BindingDB:
Activity Spreadsheet -- Enzyme Inhibition Constant Data from BindingDB
Found 1 hit for monomerid = 50427544
TargetNuclear factor NF-kappa-B p105 subunit(Homo sapiens (Human))
Universit£
Curated by ChEMBL
LigandPNGBDBM50427544(CHEMBL2322273)
Affinity DataEC50:  1.00E+5nM. Assay description: Inhibition of human NF-kappaB p50/DNA interaction using 32P-labeled oligonucleotides as substrate preincubated for 20 mins before substrate addition ...
In DepthDetails ArticlePubMed