BDBM50428472 CARBONOTRITHIOIC ACID::Carbonotrithioate
SMILES SC(S)=S
InChI Key InChIKey=HIZCIEIDIFGZSS-UHFFFAOYSA-N
Data  3 KI
PDB links: 1 PDB ID matches this monomer.
  Tab Delimited (TSV)   2D SDfile   Computed 3D by Vconf -m prep SDfile
Find this compound or compounds like it in BindingDB:
Activity Spreadsheet -- Enzyme Inhibition Constant Data from BindingDB
Found 3 hits for monomerid = 50428472
TargetCarbonic anhydrase 1(Homo sapiens (Human))
Universit£
Curated by ChEMBL
LigandPNGBDBM50428472(CARBONOTRITHIOIC ACID | Carbonotrithioate)
Affinity DataKi:  8.70E+3nM. Assay description: Inhibition of human carbonic anhydrase 1 preincubated for 15 mins by stopped-flow CO2 hydration assay
In DepthDetails ArticlePubMed
TargetCarbonic anhydrase 2(Homo sapiens (Human))
Istituto Di Biochimica Delle Proteine (Ibp)
Curated by ChEMBL
LigandPNGBDBM50428472(CARBONOTRITHIOIC ACID | Carbonotrithioate)
Affinity DataKi:  8.80E+3nM. Assay description: Inhibition of human carbonic anhydrase 2 preincubated for 15 mins by CO2 hydration stopped-flow assay
TargetCarbonic anhydrase 2(Homo sapiens (Human))
Istituto Di Biochimica Delle Proteine (Ibp)
Curated by ChEMBL
LigandPNGBDBM50428472(CARBONOTRITHIOIC ACID | Carbonotrithioate)
Affinity DataKi:  8.80E+3nM. Assay description: Inhibition of human carbonic anhydrase 2 preincubated for 15 mins by stopped-flow CO2 hydration assay