BDBM50429345 CHEMBL2334904
SMILES CCc1ccc(\C=C(\C(O)=O)c2ccc(cc2)S(C)(=O)=O)cc1
InChI Key InChIKey=RSWDBJHMEMMLHP-SFQUDFHCSA-N
Data  1 IC50
  Tab Delimited (TSV)   2D SDfile   Computed 3D by Vconf -m prep SDfile
Find this compound or compounds like it in BindingDB:
Activity Spreadsheet -- Enzyme Inhibition Constant Data from BindingDB
Found 1 hit for monomerid = 50429345
TargetAldo-keto reductase family 1 member C3(Homo sapiens (Human))
University Of Ljubljana
Curated by ChEMBL
LigandPNGBDBM50429345(CHEMBL2334904)
Affinity DataIC50:  1.36E+4nM. Assay description: Inhibition of recombinant AKR1C3 (unknown origin) assessed as decrease in oxidation of 1-acenaphthenol substrate by spectrophotometric analysis
In DepthDetails ArticlePubMed