BDBM50429440 CHEMBL2338596
SMILES Fc1cccc(c1)C(=O)N[C@H]1CCC[C@@H](C1)NC(=O)c1cccc(F)c1
InChI Key InChIKey=UBMPPNBPDAFAEE-ROUUACIJSA-N
Data  1 IC50
  Tab Delimited (TSV)   2D SDfile   Computed 3D by Vconf -m prep SDfile
Find this compound or compounds like it in BindingDB:
Activity Spreadsheet -- Enzyme Inhibition Constant Data from BindingDB
Found 1 hit for monomerid = 50429440
TargetMetabotropic glutamate receptor 5(Homo sapiens (Human))
Lundbeck Research Usa
Curated by ChEMBL
LigandPNGBDBM50429440(CHEMBL2338596)
Affinity DataIC50:  593nM. Assay description: Antagonist activity at human mGluR5 expressed in HEK293 cells assessed as inhibition of Ca2+ mobilization by FLIPR assay
In DepthDetails ArticlePubMed