BDBM50429551 CHEMBL2333757
SMILES FC(F)(F)c1cccc(Oc2ncccc2NC(=O)NCc2ccccc2)c1
InChI Key InChIKey=BRAQTBZPTCUHQV-UHFFFAOYSA-N
Data  1 KI
  Tab Delimited (TSV)   2D SDfile   Computed 3D by Vconf -m prep SDfile
Find this compound or compounds like it in BindingDB:
Activity Spreadsheet -- Enzyme Inhibition Constant Data from BindingDB
Found 1 hit for monomerid = 50429551
TargetP2Y purinoceptor 1(Homo sapiens (Human))
Bristol-Myers Squibb Research And Development
Curated by ChEMBL
LigandPNGBDBM50429551(CHEMBL2333757)
Affinity DataKi: >5.00E+3nM. Assay description: Displacement of [beta-33P]-2MeS-ADP from human P2Y1 receptor transfected in HEK293 cells assessed as residual [beta-33P] bound to plate after 1 hr by...
In DepthDetails ArticlePubMed