BDBM504303 3α,7α,11β-trihydroxy-6α-ethyl-5β-cholan-24-ol ::US11034717, Compound 4
SMILES CC[C@H]1[C@@H](O)C2C3CC[C@H]([C@H](C)CCCO)[C@@]3(C)C[C@H](O)C2[C@@]2(C)CC[C@@H](O)C[C@@H]12
InChI Key InChIKey=TVCDXGFORDLMEA-OFFOAGMXSA-N
Data  1 EC50
  Tab Delimited (TSV)   2D SDfile   Computed 3D by Vconf -m prep SDfile
Find this compound or compounds like it in BindingDB:
Activity Spreadsheet -- Enzyme Inhibition Constant Data from BindingDB
Found 1 hit for monomerid = 504303
TargetRNA-binding protein FXR1(Human)
Intercept Pharmaceuticals
US Patent
LigandPNGBDBM504303(3α,7α,11β-trihydroxy-6α-ethyl-...)
Affinity DataEC50:  264nM. Assay description: AlphaScreen was used with the aim of identifying novel modulators by taking advantage of the bimolecular interaction prevailing between FXR and the L...
Ligand InfoPC cidPC sid
In DepthDetails US Patent