BDBM50432708 CHEMBL2348223
SMILES CCCC[C@@]1(C[C@H]1[C@H](N)C(O)=O)C(O)=O
InChI Key InChIKey=CJQORTJFEFUXDX-BYULHYEWSA-N
Data  3 EC50
PDB links: 1 PDB ID matches this monomer.
  Tab Delimited (TSV)   2D SDfile   Computed 3D by Vconf -m prep SDfile
Find this compound or compounds like it in BindingDB:
Activity Spreadsheet -- Enzyme Inhibition Constant Data from BindingDB
Found 3 hits for monomerid = 50432708
TargetGlutamate receptor ionotropic, NMDA 1/2C(RAT)
University Of Copenhagen
Curated by ChEMBL
LigandPNGBDBM50432708(CHEMBL2348223)
Affinity DataEC50:  1.60E+4nM. Assay description: Agonist activity at rat recombinant wild type GluN1/GluN2C receptor expressed in Xenopus laevis oocytes by two electrode voltage clamp technique
In DepthDetails ArticlePubMed
TargetGlutamate receptor ionotropic, NMDA 1/2A(Rattus norvegicus (Rat))
University Of Copenhagen
Curated by ChEMBL
LigandPNGBDBM50432708(CHEMBL2348223)
Affinity DataEC50:  2.88E+4nM. Assay description: Agonist activity at rat recombinant wild type GluN1/GluN2A receptor expressed in Xenopus laevis oocytes by two electrode voltage clamp technique
TargetGlutamate receptor ionotropic, NMDA 1/2B(Rattus norvegicus (Rat))
University Of Copenhagen
Curated by ChEMBL
LigandPNGBDBM50432708(CHEMBL2348223)
Affinity DataEC50:  1.02E+4nM. Assay description: Agonist activity at rat recombinant wild type GluN1/GluN2B receptor expressed in Xenopus laevis oocytes by two electrode voltage clamp technique
In DepthDetails ArticlePubMed