BDBM50433595 CHEMBL2381827
SMILES CCCC(Nc1cc(C)c(c(C)c1)-n1cc(cn1)C(F)(F)F)c1ccc(cc1)C(=O)NCCC(O)=O
InChI Key InChIKey=ZMVDPNZXYJQAIH-UHFFFAOYSA-N
Data  1 KI
  Tab Delimited (TSV)   2D SDfile   Computed 3D by Vconf -m prep SDfile
Find this compound or compounds like it in BindingDB:
Activity Spreadsheet -- Enzyme Inhibition Constant Data from BindingDB
Found 1 hit for monomerid = 50433595
TargetGlucagon receptor(Homo sapiens (Human))
Pfizer
Curated by ChEMBL
LigandPNGBDBM50433595(CHEMBL2381827)
Affinity DataKi:  12nM. Assay description: Displacement of [125I]-glucagon-cex from human glucagon receptor by cell based assay in presence of 0.2% bovine serum albumin
In DepthDetails ArticlePubMed