BDBM50434238 CHEMBL2385748
SMILES CCOC(=O)C1C(NC(=O)N=C1C)c1cc(OC)c(OCc2ccccc2Cl)cc1Cl
InChI Key InChIKey=FIRZGGSSIZRSGF-UHFFFAOYSA-N
Data  1 EC50
  Tab Delimited (TSV)   2D SDfile   Computed 3D by Vconf -m prep SDfile
Find this compound or compounds like it in BindingDB:
Activity Spreadsheet -- Enzyme Inhibition Constant Data from BindingDB
Found 1 hit for monomerid = 50434238
TargetNuclear receptor ROR-alpha(Homo sapiens (Human))
Genfit
Curated by ChEMBL
LigandPNGBDBM50434238(CHEMBL2385748)
Affinity DataEC50:  5.50E+3nM. Assay description: Partial agonist activity at GST-fussed RORalpha (unknown origin) assessed as recruitment of TIF2-BAP protein after overnight incubation by pull down ...
In DepthDetails ArticlePubMed