BDBM50435014 CHEMBL2386498
SMILES B[P@@](=O)(OC[C@H]1O[C@H]([C@H](O)[C@@H]1O)n1cnc2c(N)ncnc12)OP(O)(=O)OP(O)(=O)OP(O)(=O)OP(O)(=O)OC[C@H]1O[C@H]([C@H](O)[C@@H]1O)n1cnc2c(N)ncnc12
InChI Key InChIKey=WCQBIMFYOAUQBM-YBNSYAJOSA-N
Data  1 EC50
  Tab Delimited (TSV)   2D SDfile   Computed 3D by Vconf -m prep SDfile
Find this compound or compounds like it in BindingDB:
Activity Spreadsheet -- Enzyme Inhibition Constant Data from BindingDB
Found 1 hit for monomerid = 50435014
TargetP2Y purinoceptor 1(Homo sapiens (Human))
Bar-Ilan University
Curated by ChEMBL
LigandPNGBDBM50435014(CHEMBL2386498)
Affinity DataEC50:  200nM. Assay description: Agonist activity at human GFP-tagged P2Y1R transfected in human 1321N1 cells assessed as induction of intracellular calcium mobilization by fluoresce...
In DepthDetails ArticlePubMed