BDBM50435016 CHEMBL2386494
SMILES B[P@](=O)(OC[C@H]1O[C@H]([C@H](O)[C@@H]1O)n1cnc2c(N)nc(Cl)nc12)OP(O)(=O)OP(O)(O)=O
InChI Key InChIKey=MVEBOWLCRZECEK-HZHIYJPUSA-N
Data  1 EC50
  Tab Delimited (TSV)   2D SDfile   Computed 3D by Vconf -m prep SDfile
Find this compound or compounds like it in BindingDB:
Activity Spreadsheet -- Enzyme Inhibition Constant Data from BindingDB
Found 1 hit for monomerid = 50435016
TargetP2Y purinoceptor 1(Homo sapiens (Human))
Bar-Ilan University
Curated by ChEMBL
LigandPNGBDBM50435016(CHEMBL2386494)
Affinity DataEC50:  2.50E+3nM. Assay description: Agonist activity at human GFP-tagged P2Y1R transfected in human 1321N1 cells assessed as induction of intracellular calcium mobilization by fluoresce...
In DepthDetails ArticlePubMed