BDBM50435576 CHEMBL2393134
SMILES CN(C)CCCOc1cccc2n(c(nc12)C(F)F)-c1nc(nc(n1)N1CCOCC1)N1CCOCC1
InChI Key InChIKey=XCWUPAKUQSCUGQ-UHFFFAOYSA-N
Data  3 IC50
  Tab Delimited (TSV)   2D SDfile   Computed 3D by Vconf -m prep SDfile
Find this compound or compounds like it in BindingDB:
Activity Spreadsheet -- Enzyme Inhibition Constant Data from BindingDB
Found 3 hits for monomerid = 50435576
LigandPNGBDBM50435576(CHEMBL2393134)
Affinity DataIC50:  4.5nM. Assay description: Inhibition of recombinant PI3K p110delta/p85alpha (unknown origin) using phosphotidylinositol as susbstrate after 1 hr by thin layer paper chromatogr...
In DepthDetails ArticlePubMed
LigandPNGBDBM50435576(CHEMBL2393134)
Affinity DataIC50:  11nM. Assay description: Inhibition of recombinant PI3K p110alpha/p85alpha (unknown origin) using phosphotidylinositol as susbstrate after 1 hr by thin layer paper chromatogr...
In DepthDetails ArticlePubMed
LigandPNGBDBM50435576(CHEMBL2393134)
Affinity DataIC50:  7.30nM. Assay description: Inhibition of recombinant PI3K p110beta/p85alpha (unknown origin) using phosphotidylinositol as susbstrate after 1 hr by thin layer paper chromatogra...
In DepthDetails ArticlePubMed