BDBM50435590 CHEMBL2390982
SMILES O=C(CCCOc1cc(=O)oc2ccccc12)N1CCC(Cc2ccccc2)CC1
InChI Key InChIKey=WWCCTNJSLRMIRU-UHFFFAOYSA-N
Data  2 IC50
  Tab Delimited (TSV)   2D SDfile   Computed 3D by Vconf -m prep SDfile
Find this compound or compounds like it in BindingDB:
Activity Spreadsheet -- Enzyme Inhibition Constant Data from BindingDB
Found 2 hits for monomerid = 50435590
TargetAcetylcholinesterase(Electrophorus electricus (Electric eel))
University Of Zanjan
Curated by ChEMBL
LigandPNGBDBM50435590(CHEMBL2390982)
Affinity DataIC50:  8.00E+3nM. Assay description: Inhibition of electric eel AChE using acetylthiocholine iodide as substrate preincubated for 10 mins prior to substrate addition by Ellman's method
In DepthDetails ArticlePubMed
TargetCholinesterase(Equus caballus (Horse))
University Of Zanjan
Curated by ChEMBL
LigandPNGBDBM50435590(CHEMBL2390982)
Affinity DataIC50:  7.60E+4nM. Assay description: Inhibition of equine serum BChE using butylthiocholine iodide as substrate preincubated for 10 mins prior to substrate addition by Ellman's method
In DepthDetails ArticlePubMed