BDBM50435642 CHEMBL2391594
SMILES CCOC(=O)c1ccnc(Oc2cccc(NS(=O)(=O)c3ccc(Cl)cc3)c2)c1
InChI Key InChIKey=MKZCPAAWHWWFOU-UHFFFAOYSA-N
Data  1 EC50
  Tab Delimited (TSV)   2D SDfile   Computed 3D by Vconf -m prep SDfile
Find this compound or compounds like it in BindingDB:
Activity Spreadsheet -- Enzyme Inhibition Constant Data from BindingDB
Found 1 hit for monomerid = 50435642
TargetGlucose-dependent insulinotropic receptor(Homo sapiens (Human))
Amgen
Curated by ChEMBL
LigandPNGBDBM50435642(CHEMBL2391594)
Affinity DataEC50:  160nM. Assay description: Agonist activity at human GPR119 expressed in HEK293 cells assessed as cAMP accumulation after 30 mins
In DepthDetails ArticlePubMed