BDBM50435875 CHEMBL272551
SMILES O=S(=O)(N1CCN(Cc2ccccc2)CC1)c1ccccc1
InChI Key InChIKey=BLBMBKATZISMKR-UHFFFAOYSA-N
Data  1 KI
  Tab Delimited (TSV)   2D SDfile   Computed 3D by Vconf -m prep SDfile
Find this compound or compounds like it in BindingDB:
Activity Spreadsheet -- Enzyme Inhibition Constant Data from BindingDB
Found 1 hit for monomerid = 50435875
TargetSigma non-opioid intracellular receptor 1(Cavia porcellus (Guinea pig))
Nstri
Curated by ChEMBL
LigandPNGBDBM50435875(CHEMBL272551)
Affinity DataKi:  28nM. Assay description: Displacement of [3H](+)pentazocine from sigma1 receptor in Dunkin Hartley guinea pig brain membrane after 120 mins by liquid scintillation counting a...
In DepthDetails ArticlePubMed