BDBM50437601 CHEMBL2407863
SMILES C[C@@H](N1C(=O)O[C@](Cc2ccccc2)(C(=O)NCc2ccc3cnccc3c2)C1=O)c1ccccc1
InChI Key InChIKey=LNOWBWBLUPOLFZ-ACSYHNTCSA-N
Data  1 IC50
  Tab Delimited (TSV)   2D SDfile   Computed 3D by Vconf -m prep SDfile
Find this compound or compounds like it in BindingDB:
Activity Spreadsheet -- Enzyme Inhibition Constant Data from BindingDB
Found 1 hit for monomerid = 50437601
TargetMineralocorticoid receptor(Homo sapiens (Human))
Merck Research Laboratories
Curated by ChEMBL
LigandPNGBDBM50437601(CHEMBL2407863)
Affinity DataIC50:  1.50E+3nM. Assay description: Antagonist activity at human mineralocorticoid receptor assessed as inhibition of binding to coactivator peptide by NH Pro assay
In DepthDetails ArticlePubMed