BDBM50437617 CHEMBL2407682
SMILES C[C@@H](N1C(=O)O[C@](Cc2ccccc2)(C(=O)Nc2ccc(F)cc2)C1=O)c1ccccc1
InChI Key InChIKey=PIMFYUQIXVVZRG-CRICUBBOSA-N
Data  1 IC50
  Tab Delimited (TSV)   2D SDfile   Computed 3D by Vconf -m prep SDfile
Find this compound or compounds like it in BindingDB:
Activity Spreadsheet -- Enzyme Inhibition Constant Data from BindingDB
Found 1 hit for monomerid = 50437617
TargetMineralocorticoid receptor(Homo sapiens (Human))
Merck Research Laboratories
Curated by ChEMBL
LigandPNGBDBM50437617(CHEMBL2407682)
Affinity DataIC50:  100nM. Assay description: Antagonist activity at human mineralocorticoid receptor assessed as inhibition of binding to coactivator peptide by NH Pro assay
In DepthDetails ArticlePubMed