BDBM50437620 CHEMBL2407679
SMILES C[C@@H](N1C(=O)O[C@](Cc2ccccc2)(C(=O)Nc2ccc(Cl)cc2)C1=O)c1ccc(F)cc1
InChI Key InChIKey=KGSREZIHZNJAQZ-PUAOIOHZSA-N
Data  1 IC50
  Tab Delimited (TSV)   2D SDfile   Computed 3D by Vconf -m prep SDfile
Find this compound or compounds like it in BindingDB:
Activity Spreadsheet -- Enzyme Inhibition Constant Data from BindingDB
Found 1 hit for monomerid = 50437620
TargetMineralocorticoid receptor(Homo sapiens (Human))
Merck Research Laboratories
Curated by ChEMBL
LigandPNGBDBM50437620(CHEMBL2407679)
Affinity DataIC50:  180nM. Assay description: Antagonist activity at human mineralocorticoid receptor assessed as inhibition of binding to coactivator peptide by NH Pro assay
In DepthDetails ArticlePubMed