BDBM50440850 CHEMBL238396
SMILES [#6]-[#6]-[#6@H](-[#6])-[#6@H](-[#7]-[#6](=O)-[#6@H](-[#6]-[#6](-[#6])-[#6])-[#7]-[#6](=O)-[#6@H](-[#6]-[#6]-[#6]\[#7]=[#6](\[#7])-[#7])-[#7]-[#6](=O)-[#6]-[#7]-[#6](=O)-[#6@@H](-[#7]-[#6](=O)-[#6@H](-[#6]-[#6](-[#6])-[#6])-[#7]-[#6](=O)-c1ccno1)-[#6@@H](-[#6])-[#6]-[#6])-[#6](-[#7])=O
InChI Key InChIKey=BQZRIEZJWTYOFA-DAOOESDTSA-N
Data  2 EC50
  Tab Delimited (TSV)   2D SDfile   Computed 3D by Vconf -m prep SDfile
Find this compound or compounds like it in BindingDB:
Activity Spreadsheet -- Enzyme Inhibition Constant Data from BindingDB
Found 2 hits for monomerid = 50440850
TargetProteinase-activated receptor 2(Homo sapiens (Human))
University Of Queensland
Curated by ChEMBL
LigandPNGBDBM50440850(CHEMBL238396)
Affinity DataEC50:  220nM. Assay description: Agonist activity at PAR2 expressed in human HT29 cells assessed as intracellular calcium release
In DepthDetails ArticlePubMed
TargetProteinase-activated receptor 2(Homo sapiens (Human))
University Of Queensland
Curated by ChEMBL
LigandPNGBDBM50440850(CHEMBL238396)
Affinity DataEC50:  100nM. Assay description: Agonist activity at PAR2 in human HT-29 cells assessed as increase in intracellular calcium release
In DepthDetails ArticlePubMed