BDBM50441390 CHEMBL2435921
SMILES CC(NCc1cnccc1-c1ccccc1F)c1cc(cc(c1)C(F)(F)F)C(F)(F)F
InChI Key InChIKey=DUHJCDZMEGDEOZ-UHFFFAOYSA-N
Data  2 EC50
  Tab Delimited (TSV)   2D SDfile   Computed 3D by Vconf -m prep SDfile
Find this compound or compounds like it in BindingDB:
Activity Spreadsheet -- Enzyme Inhibition Constant Data from BindingDB
Found 2 hits for monomerid = 50441390
TargetG-protein coupled bile acid receptor 1(Homo sapiens (Human))
Chinese Academy Of Sciences
Curated by ChEMBL
LigandPNGBDBM50441390(CHEMBL2435921)
Affinity DataEC50:  204nM. Assay description: Agonist activity at human TGR5 expressed in HEK293 cells assessed CRE-induced luciferase activity after 5.5 hrs by reporter gene assay
In DepthDetails ArticlePubMed
TargetG-protein coupled bile acid receptor 1(Mus musculus)
Chinese Academy Of Sciences
Curated by ChEMBL
LigandPNGBDBM50441390(CHEMBL2435921)
Affinity DataEC50:  2.04E+3nM. Assay description: Agonist activity at mouse TGR5 expressed in HEK293 cells assessed CRE-induced luciferase activity after 5.5 hrs by reporter gene assay
In DepthDetails ArticlePubMed