BDBM504415 US11040984, Compound 30
SMILES CCCN1CC2(C1)CN(C(=O)O2)c1cc2c(Nc3cccc(Cl)c3F)ncnc2cc1OC
InChI Key InChIKey=RFKWVNQTNHCTAP-UHFFFAOYSA-N
Data  2 IC50
  Tab Delimited (TSV)   2D SDfile   Computed 3D by Vconf -m prep SDfile
Find this compound or compounds like it in BindingDB:
Activity Spreadsheet -- Enzyme Inhibition Constant Data from BindingDB
Found 2 hits for monomerid = 504415
TargetEpidermal growth factor receptor [1-745,751-1210](Homo sapiens (Human))
Medshine Discovery
US Patent
LigandPNGBDBM504415(US11040984, Compound 30)
Affinity DataIC50:  0.0520nM. Assay description: Buffer formulation: a buffer consisted of 50 mM HEPES (pH 7.5), 0.01% BSA, 5 mM MgCl2, 0.1 mM Orthovanadate. After the buffer was formulated, an enzy...
Ligand InfoPC cidPC sid
In DepthDetails US Patent
TargetEpidermal growth factor receptor(Homo sapiens (Human))
Medshine Discovery
US Patent
LigandPNGBDBM504415(US11040984, Compound 30)
Affinity DataIC50:  0.0210nM. Assay description: Buffer formulation: a buffer consisted of 50 mM HEPES (pH 7.5), 0.01% BSA, 5 mM MgCl2, 0.1 mM Orthovanadate. After the buffer was formulated, an enzy...
Ligand InfoPC cidPC sid
In DepthDetails US Patent