BDBM50445264 CHEMBL3103650
SMILES CC(=O)c1cn(C)c2ccc(cc12)-c1ccc(C=C2NC(=S)NC2=O)s1
InChI Key InChIKey=VVYKIXXMXONAEM-UHFFFAOYSA-N
Data  1 IC50
  Tab Delimited (TSV)   2D SDfile   Computed 3D by Vconf -m prep SDfile
Find this compound or compounds like it in BindingDB:
Activity Spreadsheet -- Enzyme Inhibition Constant Data from BindingDB
Found 1 hit for monomerid = 50445264
TargetPerforin-1(Homo sapiens (Human))
University Of Auckland
Curated by ChEMBL
LigandPNGBDBM50445264(CHEMBL3103650)
Affinity DataIC50:  5.30E+3nM. Assay description: Inhibition of recombinant perforin (unknown origin)-mediated lysis of human [51Cr]-labelled Jurkat cells assessed as release of [51Cr] preincubated f...
In DepthDetails ArticlePubMed