BDBM50446904 CHEMBL3115292
SMILES OC(=O)CNC(=O)c1c(O)c(Br)cc2n(Cc3ccccc3)cnc12
InChI Key InChIKey=FAZKYZZMYJHLOX-UHFFFAOYSA-N
Data  1 IC50
  Tab Delimited (TSV)   2D SDfile   Computed 3D by Vconf -m prep SDfile
Find this compound or compounds like it in BindingDB:
Activity Spreadsheet -- Enzyme Inhibition Constant Data from BindingDB
Found 1 hit for monomerid = 50446904
TargetProlyl hydroxylase EGLN3(Homo sapiens (Human))
Janssen Research And Development
Curated by ChEMBL
LigandPNGBDBM50446904(CHEMBL3115292)
Affinity DataIC50:  1nM. Assay description: Inhibition of 6His-tagged PHD3 (1 to 239) (unknown origin)-mediated Cy5CODD hydroxylation expressed in Escherichia coli preincubated for 3 mins follo...
In DepthDetails ArticlePubMed