BDBM50447664 CHEMBL3112949
SMILES Clc1ccc(Oc2cccc(CN3CCC4(CN(C4)C(=O)Nc4nnn[nH]4)CC3)c2)cc1
InChI Key InChIKey=UNAPYEWUFGRMRB-UHFFFAOYSA-N
Data  2 IC50
  Tab Delimited (TSV)   2D SDfile   Computed 3D by Vconf -m prep SDfile
Find this compound or compounds like it in BindingDB:
Activity Spreadsheet -- Enzyme Inhibition Constant Data from BindingDB
Found 2 hits for monomerid = 50447664
TargetFatty-acid amide hydrolase 1(Homo sapiens (Human))
Janssen Research And Development
Curated by ChEMBL
LigandPNGBDBM50447664(CHEMBL3112949)
Affinity DataIC50:  3.25E+3nM. Assay description: Inhibition of human FAAH after 60 mins
In DepthDetails ArticlePubMed
TargetFatty-acid amide hydrolase 1 [30-579](Rattus norvegicus (rat))
Janssen Research And Development
Curated by ChEMBL
LigandPNGBDBM50447664(CHEMBL3112949)
Affinity DataIC50:  56nM. Assay description: Inhibition of rat FAAH after 60 mins
In DepthDetails ArticlePubMed