BDBM50447710 CHEMBL3113007
SMILES Fc1cccc(c1)S(=O)(=O)N1CCCc2ccc(Oc3cc(cc(Cl)n3)-c3nc(no3)C3CC3)cc12
InChI Key InChIKey=AMGKJGKFZBRFFL-UHFFFAOYSA-N
Data  1 EC50
  Tab Delimited (TSV)   2D SDfile   Computed 3D by Vconf -m prep SDfile
Find this compound or compounds like it in BindingDB:
Activity Spreadsheet -- Enzyme Inhibition Constant Data from BindingDB
Found 1 hit for monomerid = 50447710
TargetGlucose-dependent insulinotropic receptor(Homo sapiens (Human))
Amgen
Curated by ChEMBL
LigandPNGBDBM50447710(CHEMBL3113007)
Affinity DataEC50:  320nM. Assay description: Agonist activity at human GPR119 expressed in HEK293 cells assessed as cAMP accumulation after 30 mins
In DepthDetails ArticlePubMed