BDBM50447711 CHEMBL3112996
SMILES Clc1ccc(cc1)S(=O)(=O)N1CCS(=O)(=O)c2cc(Cl)c(Oc3cc(cc(Cl)n3)-c3nc(no3)C3CC3)cc12
InChI Key InChIKey=YWRXZPIINXPNAF-UHFFFAOYSA-N
Data  1 EC50
  Tab Delimited (TSV)   2D SDfile   Computed 3D by Vconf -m prep SDfile
Find this compound or compounds like it in BindingDB:
Activity Spreadsheet -- Enzyme Inhibition Constant Data from BindingDB
Found 1 hit for monomerid = 50447711
TargetGlucose-dependent insulinotropic receptor(Homo sapiens (Human))
Amgen
Curated by ChEMBL
LigandPNGBDBM50447711(CHEMBL3112996)
Affinity DataEC50:  310nM. Assay description: Agonist activity at human GPR119 expressed in HEK293 cells assessed as cAMP accumulation after 30 mins
In DepthDetails ArticlePubMed