BDBM50447744 CHEMBL3112990
SMILES Fc1cc2CCCN(c2cc1Oc1cc(cc(Cl)n1)-c1nc(no1)C1CC1)S(=O)(=O)c1ccc(Cl)cc1
InChI Key InChIKey=FUHLNOYZLFOYIM-UHFFFAOYSA-N
Data  1 EC50
  Tab Delimited (TSV)   2D SDfile   Computed 3D by Vconf -m prep SDfile
Find this compound or compounds like it in BindingDB:
Activity Spreadsheet -- Enzyme Inhibition Constant Data from BindingDB
Found 1 hit for monomerid = 50447744
TargetGlucose-dependent insulinotropic receptor(Homo sapiens (Human))
Amgen
Curated by ChEMBL
LigandPNGBDBM50447744(CHEMBL3112990)
Affinity DataEC50:  40nM. Assay description: Agonist activity at human GPR119 expressed in HEK293 cells assessed as cAMP accumulation after 30 mins
In DepthDetails ArticlePubMed