BDBM50450464 CHEMBL4176890
SMILES Oc1c(F)cc(c2cccnc12)S(=O)(=O)c1ccc(cc1)C(F)(F)F
InChI Key InChIKey=TZTVOCRNTLVDNF-UHFFFAOYSA-N
Data  2 IC50
  Tab Delimited (TSV)   2D SDfile   Computed 3D by Vconf -m prep SDfile
Find this compound or compounds like it in BindingDB:
Activity Spreadsheet -- Enzyme Inhibition Constant Data from BindingDB
Found 2 hits for monomerid = 50450464
TargetLanosterol synthase(Rattus norvegicus)
Lieber Institute For Brain Development
Curated by ChEMBL
LigandPNGBDBM50450464(CHEMBL4176890)
Affinity DataIC50:  79nM. Assay description: Inhibition of c-terminal hexa-His tagged human MB-COMT expressed in HEK293 cell membrane homogenate using norepinephrine as substrate after 1 hr in p...
Ligand InfoPC cidPC sid
In DepthDetails ArticlePubMed
TargetLanosterol synthase(Rattus norvegicus)
Lieber Institute For Brain Development
Curated by ChEMBL
LigandPNGBDBM50450464(CHEMBL4176890)
Affinity DataIC50:  6.31E+3nM. Assay description: Inhibition of c-terminal hexa-His tagged human S-COMT expressed in HEK293-6E cell membrane homogenate using 7,8-dihydroxy-4-methylcoumarin as substra...
Ligand InfoPC cidPC sid
In DepthDetails ArticlePubMed