BDBM50451027 CHEMBL4211310
SMILES CC[C@](C)(NC(=O)[C@H](CC1CCCCC1)NC(=O)[C@H](Cc1ccncc1)NC(=O)[C@](C)(CC)NC(=O)[C@H]1C[C@H](O)CN1C(=O)[C@H](CO)NC(=O)c1c[nH]cn1)C(=O)N[C@@H](CC(N)=O)C(=O)N[C@@H](CCCCN)C(=O)NC(C)(C)C(=O)N[C@@H]([C@@H](C)O)C(=O)N[C@@H](CCCNC(N)=N)C(=O)N[C@@H](CCC(N)=O)C(=O)N[C@@H](CCCNC(N)=N)C(=O)N[C@@H](CC1CCCCC1)C(N)=O
InChI Key InChIKey=RYNMKLXXCXVVSR-JCIVFVLUSA-N
Data  1 IC50  1 EC50
  Tab Delimited (TSV)   2D SDfile   Computed 3D by Vconf -m prep SDfile
Find this compound or compounds like it in BindingDB:
Activity Spreadsheet -- Enzyme Inhibition Constant Data from BindingDB
Found 2 hits for monomerid = 50451027
TargetNeuropeptide Y receptor type 2(Homo sapiens (Human))
Takeda Pharmaceutical
Curated by ChEMBL
LigandPNGBDBM50451027(CHEMBL4211310)
Affinity DataEC50:  0.130nM. Assay description: Agonist activity at human neuropeptide Y2 receptor expressed in CHO cell membranes assessed as stimulation of [35S]GTPgammaS binding incubated for 12...
Ligand InfoPC cidPC sid
In DepthDetails ArticlePubMed
TargetNeuropeptide Y receptor type 2(Homo sapiens (Human))
Takeda Pharmaceutical
Curated by ChEMBL
LigandPNGBDBM50451027(CHEMBL4211310)
Affinity DataIC50:  0.440nM. Assay description: Displacement of [125I]-PYY from human neuropeptide Y2 receptor expressed in CHO cell membranes incubated for 60 mins by TopCount based method
Ligand InfoPC cidPC sid
In DepthDetails ArticlePubMed