BDBM50451200 CHEMBL65145
SMILES COC(=O)C[C@H](NC(=O)OC(C)(C)C)C(=O)OCc1ccc(OC)cc1
InChI Key InChIKey=MGQWXBZRKHHHKJ-AWEZNQCLSA-N
Data  1 IC50
  Tab Delimited (TSV)   2D SDfile   Computed 3D by Vconf -m prep SDfile
Find this compound or compounds like it in BindingDB:
Activity Spreadsheet -- Enzyme Inhibition Constant Data from BindingDB
Found 1 hit for monomerid = 50451200
TargetVoltage-dependent N-type calcium channel subunit alpha-1B(Homo sapiens (Human))
No Pharmaceutical
Curated by ChEMBL
LigandPNGBDBM50451200(CHEMBL65145)
Affinity DataIC50:  2.60E+4nM. Assay description: In vitro inhibition against N-type calcium influx in IMR-32 cells
In DepthDetails ArticlePubMed