BDBM50451207 CHEMBL65467
SMILES COc1ccc(CN(C)C(=O)[C@H](COCC2CCCCC2)NC(=O)OC(C)(C)C)cc1
InChI Key InChIKey=FSSSFIXFHUMUGQ-NRFANRHFSA-N
Data  1 IC50
  Tab Delimited (TSV)   2D SDfile   Computed 3D by Vconf -m prep SDfile
Find this compound or compounds like it in BindingDB:
Activity Spreadsheet -- Enzyme Inhibition Constant Data from BindingDB
Found 1 hit for monomerid = 50451207
TargetVoltage-dependent N-type calcium channel subunit alpha-1B(Homo sapiens (Human))
No Pharmaceutical
Curated by ChEMBL
LigandPNGBDBM50451207(CHEMBL65467)
Affinity DataIC50:  1.80E+3nM. Assay description: In vitro inhibition against N-type calcium influx in IMR-32 cells
In DepthDetails ArticlePubMed