BDBM50451952 CHEMBL2111730
SMILES COc1cc2CCN3c2c(n1)C(=N[C@@H](NC(=O)c1cccnc1)C3=O)c1ccccc1
InChI Key InChIKey=MXUGSITVXIZQHM-NRFANRHFSA-N
Data  4 IC50
  Tab Delimited (TSV)   2D SDfile   Computed 3D by Vconf -m prep SDfile
Find this compound or compounds like it in BindingDB:
Activity Spreadsheet -- Enzyme Inhibition Constant Data from BindingDB
Found 4 hits for monomerid = 50451952
LigandPNGBDBM50451952(CHEMBL2111730)
Affinity DataIC50:  1.40E+4nM. Assay description: Inhibition of Phosphodiesterase 1
In DepthDetails ArticlePubMed
TargetcGMP-specific 3',5'-cyclic phosphodiesterase(Homo sapiens (Human))
Pfizer
Curated by ChEMBL
LigandPNGBDBM50451952(CHEMBL2111730)
Affinity DataIC50: >1.00E+5nM. Assay description: Inhibition of Phosphodiesterase 5
In DepthDetails ArticlePubMed
TargetcAMP-specific 3',5'-cyclic phosphodiesterase 4A/4B/4C/4D(Homo sapiens (Human))
Pfizer
Curated by ChEMBL
LigandPNGBDBM50451952(CHEMBL2111730)
Affinity DataIC50:  6.10E+3nM. Assay description: Inhibition of phosphodiesterase 4
In DepthDetails ArticlePubMed
TargetcGMP-inhibited 3',5'-cyclic phosphodiesterase 3A/3B(Homo sapiens (Human))
Pfizer
Curated by ChEMBL
LigandPNGBDBM50451952(CHEMBL2111730)
Affinity DataIC50:  1.20E+4nM. Assay description: Inhibition of phosphodiesterase 3
In DepthDetails ArticlePubMed