BDBM50452390 CHEMBL4214867
SMILES CCC[C@@H]1N=C(c2ccccc2)c2cc(Cl)ccc2NC1=S
InChI Key InChIKey=FIDJHCPHMOGTHD-INIZCTEOSA-N
Data  1 EC50
  Tab Delimited (TSV)   2D SDfile   Computed 3D by Vconf -m prep SDfile
Find this compound or compounds like it in BindingDB:
Activity Spreadsheet -- Enzyme Inhibition Constant Data from BindingDB
Found 1 hit for monomerid = 50452390
TargetMuscarinic acetylcholine receptor M1(Homo sapiens (Human))
Roche Pharma Research And Early Development
Curated by ChEMBL
LigandPNGBDBM50452390(CHEMBL4214867)
Affinity DataEC50:  238nM. Assay description: Positive allosteric modulation of human wild type M1 receptor assessed as increase in acetylcholine-induced calcium flux by FLIPR assay
Ligand InfoPC cidPC sid
In DepthDetails ArticlePubMed