BDBM50456362 CHEMBL4206693::US11001575, Example 35
SMILES CC(C)(NC(=O)CN1Cc2ccc(cc2C1=O)-c1nc(NC2CCOCC2)ncc1Cl)c1ccccc1
InChI Key InChIKey=OBEQPUMSPDLFGN-UHFFFAOYSA-N
Data  3 IC50
PDB links: 1 PDB ID matches this monomer.
  Tab Delimited (TSV)   2D SDfile   Computed 3D by Vconf -m prep SDfile
Find this compound or compounds like it in BindingDB:
Activity Spreadsheet -- Enzyme Inhibition Constant Data from BindingDB
Found 3 hits for monomerid = 50456362
TargetMitogen-activated protein kinase 1(Homo sapiens (Human))
Astex Pharmaceuticals
Curated by ChEMBL
LigandPNGBDBM50456362(CHEMBL4206693 | US11001575, Example 35)
Affinity DataIC50:  7.90nM. Assay description: Inhibition of full length human N-terminal MAHHHHHH-tagged ERK2 expressed in Escherichia coli BL21 (DE3) using ATF2-GFP as substrate after 30 mins by...
Ligand InfoPC cidPC sidPDB
TargetMitogen-activated protein kinase 1(Homo sapiens (Human))
Astex Pharmaceuticals
Curated by ChEMBL
LigandPNGBDBM50456362(CHEMBL4206693 | US11001575, Example 35)
Affinity DataIC50:  7.90nM. Assay description: Activity of ERK2 enzyme (Life Technologies) was determined using a time-resolved fluorescence format measuring the phosphorylation of a truncated ver...
Ligand InfoPC cidPC sidPDB
TargetMitogen-activated protein kinase 1(Homo sapiens (Human))
Astex Pharmaceuticals
Curated by ChEMBL
LigandPNGBDBM50456362(CHEMBL4206693 | US11001575, Example 35)
Affinity DataIC50:  7.90nM. Assay description: Activity of ERK2 enzyme (Life Technologies) was determined using a time-resolved fluorescence format measuring the phosphorylation of a truncated ver...
Ligand InfoPC cidPC sidPDB