BDBM50456726 CHEMBL4218231
SMILES C[C@H]1SC(=N[C@@H]1CO)c1ccccc1O
InChI Key InChIKey=ZVWPMYHMXUXIMC-VXNVDRBHSA-N
Data  10 KI
  Tab Delimited (TSV)   2D SDfile   Computed 3D by Vconf -m prep SDfile
Find this compound or compounds like it in BindingDB:
Activity Spreadsheet -- Enzyme Inhibition Constant Data from BindingDB
Found 10 hits for monomerid = 50456726
Target5-hydroxytryptamine receptor 2A(Homo sapiens (Human))
University Of The Philippines
Curated by ChEMBL
LigandPNGBDBM50456726(CHEMBL4218231)
Affinity DataKi: >10nM. Assay description: Displacement of [3H]Ketanserin from 5-HT2A (unknown origin) receptor after 90 mins by microbeta scintillation counting analysis
Ligand InfoPC cidPC sid
In DepthDetails ArticlePubMed
Target5-hydroxytryptamine receptor 6(Homo sapiens (Human))
University Of The Philippines
Curated by ChEMBL
LigandPNGBDBM50456726(CHEMBL4218231)
Affinity DataKi: >10nM. Assay description: Displacement of [3H]-LSD from human 5-HT6 receptor expressed in HEK cells after 90 mins by microbeta scintillation counting analysis
Ligand InfoPC cidPC sid
In DepthDetails ArticlePubMed
Target5-hydroxytryptamine receptor 1B(Homo sapiens (Human))
University Of The Philippines
Curated by ChEMBL
LigandPNGBDBM50456726(CHEMBL4218231)
Affinity DataKi: >10nM. Assay description: Displacement of [3H]5-CT from human 5-HT1B receptor expressed in HEK cells after 90 mins by microbeta scintillation counting analysis
Ligand InfoPC cidPC sid
In DepthDetails ArticlePubMed
Target5-hydroxytryptamine receptor 5A(Homo sapiens (Human))
University Of The Philippines
Curated by ChEMBL
LigandPNGBDBM50456726(CHEMBL4218231)
Affinity DataKi: >10nM. Assay description: Displacement of [3H]-LSD from human 5-HT5A receptor expressed in Flp-In CHO cells after 90 mins by microbeta scintillation counting analysis
Ligand InfoPC cidPC sid
In DepthDetails ArticlePubMed
Target5-hydroxytryptamine receptor 7(Homo sapiens (Human))
University Of The Philippines
Curated by ChEMBL
LigandPNGBDBM50456726(CHEMBL4218231)
Affinity DataKi: >10nM. Assay description: Displacement of [3H]-LSD from human 5-HT7A receptor expressed in HEK cells after 90 mins by microbeta scintillation counting analysis
Ligand InfoPC cidPC sid
In DepthDetails ArticlePubMed
Target5-hydroxytryptamine receptor 3A(Homo sapiens (Human))
University Of The Philippines
Curated by ChEMBL
LigandPNGBDBM50456726(CHEMBL4218231)
Affinity DataKi: >10nM. Assay description: Displacement of [3H]-GR65630 from human 5-HT3 receptor expressed in HEKT cells after 90 mins by microbeta scintillation counting analysis
Ligand InfoPC cidPC sid
In DepthDetails ArticlePubMed
Target5-hydroxytryptamine receptor 1E(Homo sapiens (Human))
University Of The Philippines
Curated by ChEMBL
LigandPNGBDBM50456726(CHEMBL4218231)
Affinity DataKi: >10nM. Assay description: Displacement of [3H]5-HT from human 5-HT1E receptor expressed in HEK cells after 90 mins by microbeta scintillation counting analysis
Ligand InfoPC cidPC sid
In DepthDetails ArticlePubMed
Target5-hydroxytryptamine receptor 1D(Homo sapiens (Human))
University Of The Philippines
Curated by ChEMBL
LigandPNGBDBM50456726(CHEMBL4218231)
Affinity DataKi: >10nM. Assay description: Displacement of [3H]5-CT from human 5-HT1D receptor expressed in HEKT cells after 90 mins by microbeta scintillation counting analysis
Ligand InfoPC cidPC sid
In DepthDetails ArticlePubMed
Target5-hydroxytryptamine receptor 2B(Homo sapiens (Human))
University Of The Philippines
Curated by ChEMBL
LigandPNGBDBM50456726(CHEMBL4218231)
Affinity DataKi:  620nM. Assay description: Displacement of [3H]-LSD from human 5-HT2B receptor expressed in HEK cells after 90 mins by microbeta scintillation counting analysis
Ligand InfoPC cidPC sid
In DepthDetails ArticlePubMed
Target5-hydroxytryptamine receptor 2C(Homo sapiens (Human))
University Of The Philippines
Curated by ChEMBL
LigandPNGBDBM50456726(CHEMBL4218231)
Affinity DataKi:  2.20E+3nM. Assay description: Displacement of [3H]-Mesulergine from human 5-HT2C receptor expressed in HEKT cells after 90 mins by microbeta scintillation counting analysis
Ligand InfoPC cidPC sid
In DepthDetails ArticlePubMed