BDBM50458044 CHEMBL4208813
SMILES CCN1CCc2nc(Nc3ncc(F)c(n3)-c3cc(F)c4nc(C)n(C(C)C)c4c3)ccc2C1
InChI Key InChIKey=FBUYSZWFYRBPBV-UHFFFAOYSA-N
Data  2 IC50
  Tab Delimited (TSV)   2D SDfile   Computed 3D by Vconf -m prep SDfile
Find this compound or compounds like it in BindingDB:
Activity Spreadsheet -- Enzyme Inhibition Constant Data from BindingDB
Found 2 hits for monomerid = 50458044
TargetCyclin-dependent kinase 4/G1/S-specific cyclin-E1(Homo sapiens (Human))
Shanghai Haihe Pharmaceutical
Curated by ChEMBL
LigandPNGBDBM50458044(CHEMBL4208813)
Affinity DataIC50:  1.5nM. Assay description: Inhibition of human CDK4/cyclin D1 using ULight-substrate after 1 hr by LANCE assay
Ligand InfoPC cidPC sid
In DepthDetails ArticlePubMed
TargetCyclin-dependent kinase/G2/mitotic-specific cyclin- 1(Homo sapiens (Human))
Shanghai Haihe Pharmaceutical
Curated by ChEMBL
LigandPNGBDBM50458044(CHEMBL4208813)
Affinity DataIC50:  467nM. Assay description: Inhibition of human CDK1/Cyclin-B using ULight-substrate after 1 hr by LANCE assay
Ligand InfoPC cidPC sid
In DepthDetails ArticlePubMed