BDBM50460759 CHEMBL4226014
SMILES CCCCCCCC(=O)NCCc1ccc(O)c(O)c1
InChI Key InChIKey=MGRVMTGNRVNIEL-UHFFFAOYSA-N
Data  3 EC50
  Tab Delimited (TSV)   2D SDfile   Computed 3D by Vconf -m prep SDfile
Find this compound or compounds like it in BindingDB:
Activity Spreadsheet -- Enzyme Inhibition Constant Data from BindingDB
Found 3 hits for monomerid = 50460759
TargetTransient receptor potential cation channel subfamily V member 1(Homo sapiens (Human))
Mannheim University Of Applied Sciences
Curated by ChEMBL
LigandPNGBDBM50460759(CHEMBL4226014)
Affinity DataEC50:  5.89E+3nM. Assay description: Agonist activity at recombinant TRPV1 (unknown origin) expressed in HEK293 cells assessed as induction of calcium flux administered for 1 min followe...
In DepthDetails ArticlePubMed
TargetTransient receptor potential cation channel subfamily V member 1(Rattus norvegicus (rat))
Mannheim University Of Applied Sciences
Curated by ChEMBL
LigandPNGBDBM50460759(CHEMBL4226014)
Affinity DataEC50:  7.10E+3nM. Assay description: Activation of rat TRPV1 transfected in HEK293 cells assessed as increase in calcium influx in presence of capsaicin by FURA-2-AM dye based fluorescen...
In DepthDetails ArticlePubMed
TargetTransient receptor potential cation channel subfamily V member 1(Homo sapiens (Human))
Mannheim University Of Applied Sciences
Curated by ChEMBL
LigandPNGBDBM50460759(CHEMBL4226014)
Affinity DataEC50:  5.93E+3nM. Assay description: Agonist activity at recombinant TRPV1 (unknown origin) expressed in HEK293 cells assessed as induction of calcium flux administered for 1 min followe...
In DepthDetails ArticlePubMed