BDBM50461580 CHEMBL4229045
SMILES O=c1c(n[nH]c2c(cnn12)-c1cccc2ccccc12)-c1cc[nH]n1
InChI Key InChIKey=FSPKFJKXUUXBHJ-UHFFFAOYSA-N
Data  2 KI
  Tab Delimited (TSV)   2D SDfile   Computed 3D by Vconf -m prep SDfile
Find this compound or compounds like it in BindingDB:
Activity Spreadsheet -- Enzyme Inhibition Constant Data from BindingDB
Found 2 hits for monomerid = 50461580
TargetGamma-aminobutyric acid receptor subunit alpha-1/beta-2/gamma-2(Rattus norvegicus (Rat))
Universit£
Curated by ChEMBL
LigandPNGBDBM50461580(CHEMBL4229045)
Affinity DataKi:  150nM. Assay description: Displacement of [3H]Ro15-1788 from recombinant rat GABAAalpha1/beta2/gamma2 receptor after 90 mins by liquid scintillation counting method
Ligand InfoPC cidPC sid
In DepthDetails ArticlePubMed
TargetGamma-aminobutyric acid receptor subunit alpha-5/beta-3/gamma-2(Rattus norvegicus (Rat))
Universit£
Curated by ChEMBL
LigandPNGBDBM50461580(CHEMBL4229045)
Affinity DataKi:  159nM. Assay description: Displacement of [3H]Ro15-1788 from recombinant rat GABAAalpha5/beta3/gamma2 receptor after 90 mins by liquid scintillation counting method
Ligand InfoPC cidPC sid
In DepthDetails ArticlePubMed