BDBM50461604 CHEMBL4228900
SMILES CC(=O)c1cn(C)c(=O)c2ccc(cc12)-c1ccccc1
InChI Key InChIKey=XDGAOVMRTQVKSB-UHFFFAOYSA-N
Data  1 IC50
  Tab Delimited (TSV)   2D SDfile   Computed 3D by Vconf -m prep SDfile
Find this compound or compounds like it in BindingDB:
Activity Spreadsheet -- Enzyme Inhibition Constant Data from BindingDB
Found 1 hit for monomerid = 50461604
TargetBromodomain-containing protein 4(Homo sapiens (Human))
Celgene Quanticel Research
Curated by ChEMBL
LigandPNGBDBM50461604(CHEMBL4228900)
Affinity DataIC50:  8.10E+4nM. Assay description: Inhibition of His-tagged human BRD4-BD1 using H4K5acK8acK12acK16ac as substrate preincubated for 30 mins followed by substrate addition measured afte...
Ligand InfoPC cidPC sid
In DepthDetails ArticlePubMed