BDBM50462179 CHEMBL4245263
SMILES Fc1ccc2c(noc2c1)C1CCN(CC[C@@H]2CCCN2S(=O)(=O)c2cncc3ccccc23)CC1
InChI Key InChIKey=XPLJHFADXYVMHJ-QFIPXVFZSA-N
Data  5 KI
  Tab Delimited (TSV)   2D SDfile   Computed 3D by Vconf -m prep SDfile
Find this compound or compounds like it in BindingDB:
Activity Spreadsheet -- Enzyme Inhibition Constant Data from BindingDB
Found 5 hits for monomerid = 50462179
TargetD(2) dopamine receptor(Homo sapiens (Human))
Jagiellonian University Medical College
Curated by ChEMBL
LigandPNGBDBM50462179(CHEMBL4245263)
Affinity DataKi:  0.100nM. Assay description: Displacement of [3H]-raclopride from human D2LR expressed in HEK293 cell membranes after 1 hr at 37 degC by microbeta counting method
Ligand InfoPC cidPC sid
In DepthDetails ArticlePubMed
Target5-hydroxytryptamine receptor 7(Homo sapiens (Human))
Jagiellonian University Medical College
Curated by ChEMBL
LigandPNGBDBM50462179(CHEMBL4245263)
Affinity DataKi:  0.400nM. Assay description: Displacement of [3H]-5-CT from human 5-HT7R expressed in HEK293 cell membranes after 1 hr at 37 degC by microbeta counting method
Ligand InfoPC cidPC sid
In DepthDetails ArticlePubMed
Target5-hydroxytryptamine receptor 2A(Homo sapiens (Human))
Jagiellonian University Medical College
Curated by ChEMBL
LigandPNGBDBM50462179(CHEMBL4245263)
Affinity DataKi:  6nM. Assay description: Displacement of [3H]-ketanserin from human 5-HT2AR expressed in CHO-K1 cell membranes after 1.5 hrs by microbeta counting method
Ligand InfoPC cidPC sid
In DepthDetails ArticlePubMed
Target5-hydroxytryptamine receptor 1A(Homo sapiens (Human))
Jagiellonian University Medical College
Curated by ChEMBL
LigandPNGBDBM50462179(CHEMBL4245263)
Affinity DataKi:  111nM. Assay description: Displacement of [3H]-8-OH-DPAT from human 5-HT1AR expressed in HEK293 cell membranes after 1 hr by microbeta counting method
Ligand InfoPC cidPC sid
In DepthDetails ArticlePubMed
Target5-hydroxytryptamine receptor 6(Homo sapiens (Human))
Jagiellonian University Medical College
Curated by ChEMBL
LigandPNGBDBM50462179(CHEMBL4245263)
Affinity DataKi:  137nM. Assay description: Displacement of [3H]-LSD from human 5-HT6R expressed in HEK293 cell membranes after 1 hr at 37 degC by microbeta counting method
Ligand InfoPC cidPC sid
In DepthDetails ArticlePubMed