BDBM50465029 CHEMBL4283967
SMILES COC(=O)CCCCOc1cccc2c(cn(CC3CCOCC3)c12)C(=O)c1ccc(OC)cc1
InChI Key InChIKey=OLTLDMBUAZEVQX-UHFFFAOYSA-N
Data  2 KI  1 IC50
  Tab Delimited (TSV)   2D SDfile   Computed 3D by Vconf -m prep SDfile
Find this compound or compounds like it in BindingDB:
Activity Spreadsheet -- Enzyme Inhibition Constant Data from BindingDB
Found 3 hits for monomerid = 50465029
TargetCannabinoid receptor 2(Homo sapiens (Human))
University Of Otago
Curated by ChEMBL
LigandPNGBDBM50465029(CHEMBL4283967)
Affinity DataKi:  201nM. Assay description: Displacement of [3H]CP55,940 from N-terminal HA-tagged human CB2 receptor expressed in HEK293 cell membranes after 1 hr by microbeta scintillation co...
Ligand InfoPC cidPC sid
In DepthDetails ArticlePubMed
TargetCannabinoid receptor 1(Homo sapiens (Human))
University Of Otago
Curated by ChEMBL
LigandPNGBDBM50465029(CHEMBL4283967)
Affinity DataKi:  1.58E+3nM. Assay description: Displacement of [3H]CP55,940 from N-terminal HA-tagged human CB1 receptor expressed in HEK293 cell membranes after 1 hr by microbeta scintillation co...
Ligand InfoPC cidPC sid
In DepthDetails ArticlePubMed
TargetCannabinoid receptor 2(Homo sapiens (Human))
University Of Otago
Curated by ChEMBL
LigandPNGBDBM50465029(CHEMBL4283967)
Affinity DataIC50: >1.00E+4nM. Assay description: Inverse agonist activity at N-terminal HA-tagged human CB2 receptor expressed in HEK293 cells transfected with YFP-Epac-RLuc assessed as increase in ...
Ligand InfoPC cidPC sid
In DepthDetails ArticlePubMed