BDBM50465047 CHEMBL4293194
SMILES Oc1ccc2n(CC3CCOCC3)cc(C(=O)c3cccc4ccccc34)c2c1
InChI Key InChIKey=USRUTFMMGDBKMJ-UHFFFAOYSA-N
Data  2 KI  1 EC50
  Tab Delimited (TSV)   2D SDfile   Computed 3D by Vconf -m prep SDfile
Find this compound or compounds like it in BindingDB:
Activity Spreadsheet -- Enzyme Inhibition Constant Data from BindingDB
Found 3 hits for monomerid = 50465047
TargetCannabinoid receptor 2(Homo sapiens (Human))
University Of Otago
Curated by ChEMBL
LigandPNGBDBM50465047(CHEMBL4293194)
Affinity DataKi:  275nM. Assay description: Displacement of [3H]CP55,940 from N-terminal HA-tagged human CB2 receptor expressed in HEK293 cell membranes after 1 hr by microbeta scintillation co...
Ligand InfoPC cidPC sid
In DepthDetails ArticlePubMed
TargetCannabinoid receptor 1(Homo sapiens (Human))
University Of Otago
Curated by ChEMBL
LigandPNGBDBM50465047(CHEMBL4293194)
Affinity DataKi:  824nM. Assay description: Displacement of [3H]CP55,940 from N-terminal HA-tagged human CB1 receptor expressed in HEK293 cell membranes after 1 hr by microbeta scintillation co...
Ligand InfoPC cidPC sid
In DepthDetails ArticlePubMed
TargetCannabinoid receptor 2(Homo sapiens (Human))
University Of Otago
Curated by ChEMBL
LigandPNGBDBM50465047(CHEMBL4293194)
Affinity DataEC50:  15nM. Assay description: Agonist activity at N-terminal HA-tagged human CB2 receptor expressed in HEK293 cells transfected with YFP-Epac-RLuc assessed as decrease in forskoli...
Ligand InfoPC cidPC sid
In DepthDetails ArticlePubMed